AHB-Lite 总线矩阵:多层互连、并行访问与仲裁/流水线
更新时间:2026-09-19。前置:AHB/APB 与桥接、AHB-Lite 流水线与拆分、AXI Crossbar。单层 AHB 同一时刻只能一对主从通信,多主 SoC 需要**总线矩阵(multi-layer bus matrix / AHB interconnect)**让访问不同从机的主设备并行。
本文要回答的问题
- AHB-Lite 的地址相位和数据相位怎么流水?
- 总线矩阵内部由哪些级构成,如何实现「不同从机并行、同一从机仲裁」?
- HREADY/HRESP 在多主环境里怎么正确反馈?
- 默认从机、定序器和多层互连有哪些死锁坑?
一、AHB-Lite 传输回顾
AHB 是单地址/数据总线、两级流水协议:
- 地址相位:主设备驱动 HADDR、HTRANS(IDLE/BUSY/NONSEQ/SEQ)、读写控制。
- 数据相位:下一周期收发 HWDATA/HRDATA,从机用 HREADY 拉低插入等待(延长数据相位),用 HRESP 报 OKAY/ERROR。
- 因此在从机处理第 N 笔数据时,主设备本可在地址总线上放第 N+1 笔;HREADY 低会同时冻结地址推进。
单层 AHB 任何时刻只有一个主设备占用总线,靠一个中央仲裁器(arbiter,HMASTER/HMASTLOCK)授予。
二、为什么要总线矩阵
典型 SoC:CPU、DMA、以太网、加密引擎都是主设备,SRAM0、SRAM1、外设是从设备。若 CPU 访 SRAM0 时 DMA 也要访 SRAM1,单层总线必须排队;总线矩阵让两路只要目标不同就并行,显著提吞吐(思想同 AXI Crossbar,但 AHB 因信号简单、无独立读写通道,结构更紧凑)。
三、矩阵内部结构
Master0 ─►[输入寄存/仲裁层]─┐
Master1 ─►[输入寄存/仲裁层]─┤ ┌─ 从机端口0(SRAM0): 对各主 MUX + 仲裁
Master2 ─►[输入寄存/仲裁层]─┼─►交叉开关─ 从机端口1(SRAM1)
... │ └─ 从机端口2(APB桥/外设)
每个从机端口有: 地址译码命中判断 + 在多个请求主之间仲裁 + HRDATA/HREADY 回送 MUX关键部件:
- 输入级(layer/input stage):为每个主设备寄存地址/控制(有时加 FIFO),解耦主设备时序。
- 从机端口仲裁器:每个从机一个,当多个主同时命中该从机时选一个(固定优先级/round-robin,见 仲裁公平性);不同从机互不阻塞。
- 输出 MUX/解码:把获胜主的地址/控制/写数据接到目标从机,并把该从机的 HRDATA/HREADY/HRESP 回送给对应主。
- 译码/默认从机(default slave):地址不命中任何从机时,由默认从机返回 ERROR(或定序器给固定等待),防止挂死(对照 AXI 总线超时)。
四、HREADY 的两个含义(最易错)
矩阵里要区分:
- 输入 HREADY(HREADYOUT/HREADY 到主):告诉某主设备「上一笔数据相位完成没有」。每个主设备需要自己的 ready,来自它当前访问的那个从机经 MUX 回来的 HREADYOUT。
- 从机 HREADY 输入:从机也需要一个 HREADY 输入来推进自身流水;在矩阵中这通常是「该从机端口的仲裁就绪」信号,避免在它服务别的主时错误采样。
若把全局 HREADY 直接广播给所有主,会出现:主 A 等慢外设拉低 HREADY,导致访问快 SRAM 的主 B 也被拖慢甚至协议错乱。必须按主-从连接关系各自回送。
五、流水线与定序器
- AHB 流水线允许地址提前一拍;多层矩阵常在输入级寄存,带来延迟但提频率(与 AHB-Lite 流水线拆分同源)。
- 对总是需要若干等待的从机(或空地址),可放一个 定序器/默认从机返回固定周期 HREADY=0 后 ERROR,保证每笔事务都结束,杜绝因没人拉 HREADY 造成的死锁。
- 锁定传输 HMASTLOCK(用于原子读-改-写)期间仲裁器必须保持同一主设备,不能中途换主。
六、常见的坑
- HREADY 全局广播:一个慢从机拖死所有主,或错回 ready 导致采样错位——必须逐主 MUX。
- 地址/数据相位错配:多主切换时,HRDATA 必须回送给「发出该地址的主」,MUX 选择要与上一拍仲裁结果对齐并考虑流水延迟。
- 仲裁切换点错:在一笔未完成(HREADY 低)时换主,撕裂传输;应在传输边界切换。
- HMASTLOCK 忽略:锁定序列中途被打断,原子操作失效。
- 无默认从机:访问未映射地址无人驱动 HREADY/HRESP,总线永久挂死。
- 默认从机不结束事务:只拉 ERROR 不给 ready,仍死锁;应给有限等待再 OKAY/ERROR 收尾。
- 同从机无公平仲裁:固定优先级使高带宽主饿死其他主,需 round-robin/超时。
- 输入寄存增加意外延迟:软件假设零等待,实际矩阵加了拍,影响紧时序外设。
- 写数据与地址不同源:AHB 写数据滞后地址一拍,矩阵需把 wdata 按正确主/节拍路由。
- 复位后总线浮空:未授权时 MUX 要有安全默认(OKAY/ready),否则从机采到 X。
- 死锁环路:主 A 占从机 X 等从机 Y、主 B 反之——AHB 无 AXI ID 乱序也可能在带 FIFO 的矩阵中阻塞,需防资源环。
相关与延伸
协议基础见 AHB/APB 桥;流水线见 AHB-Lite 流水线与拆分;更复杂多通道互连见 AXI Crossbar、NoC;仲裁见 round-robin 公平性。
总结
AHB-Lite 总线矩阵为每个主设备设输入寄存级、为每个从设备设独立仲裁器和回送 MUX,从而让访问不同从机的多个主设备真正并行、访问同一从机时才在传输边界仲裁;由于 AHB 是地址/数据两级流水且写数据滞后一拍,矩阵必须把每个从机的 HREADYOUT/HRESP/HRDATA 精确回送给发起对应地址相位的主设备而非全局广播,并用默认从机/定序器给未映射地址一个有限等待后的 ERROR 收尾——HREADY 错连、相位主从错配、中途切换仲裁和缺默认从机是四大死锁/错乱根因。